{"text_format":"1","workbook":"xlsx","n_sheets":10,"sheets":["Introduction","Flight log FORM","Flight log FORM (REVISED)","Performance FORM","W&B FORM","C152 Performance specs","OO-VCL","OO-BET","OO-VCR","OO-VCM"],"not_rendered":{"charts":5,"images":16,"macros":1,"external_links":0,"defined_names":4,"comments":4,"pivot_tables":0},"unopened":[],"bounds":{"document_bytes":16777216,"sheet_cells":100000,"rows_first":2000,"rows_last":500,"rows_between":2000,"halvings":0,"cell_chars":16384,"cell_head_chars":4096},"cells_cut":0,"cells_raw":0,"read":"whole","date_system":"1900"}

{"sheet":"Introduction","index":0,"n_rows":13,"n_cols":5,"rows_kept":13,"cut":false,"hidden":false,"merged":[[4,4,4,5],[6,1,8,1],[11,0,11,5],[12,0,12,5]]}
[]
[]
[]
[]
["remarks? tony.opsomer@gmail.com",null,null,null,"version 2023-07-15"]
[]
[null,"C152","Flight log form"]
[null,null,"Performance form"]
[null,null,"Weight and balance form"]
[]
[]
["Vliegclub Grimbergen BE.DTO.113"]
["download the latest version from https://goahead.classy.be/weight-balance/ "]

{"sheet":"Flight log FORM","index":1,"n_rows":68,"n_cols":58,"rows_kept":68,"cut":false,"hidden":false,"merged":[[29,7,30,7],[27,7,28,7],[35,6,36,6],[51,9,53,12],[43,9,43,12],[39,4,39,5],[40,4,40,5],[38,4,38,5],[38,6,38,7],[43,5,43,7],[44,5,44,7],[45,5,45,7],[49,5,49,8],[50,5,50,8],[16,2,16,3],[16,8,18,8],[1,1,1,3],[12,2,12,3],[16,1,18,1],[14,2,14,3],[3,1,3,3],[16,4,18,4],[16,5,18,5],[9,4,10,4],[8,5,8,6],[8,8,8,9],[8,2,8,3],[8,1,10,1],[12,8,12,9],[16,6,18,6],[16,7,18,7],[21,6,22,6],[35,9,36,9],[31,9,32,9],[21,9,22,9],[35,29,36,31],[28,14,28,16],[14,4,14,5],[3,4,3,7],[2,20,10,23],[3,15,3,19],[4,15,4,19],[5,15,6,19],[23,7,24,7],[25,7,26,7],[19,6,20,6],[21,7,22,7],[9,10,10,10],[31,6,32,6],[29,6,30,6],[27,6,28,6],[33,6,34,6],[16,23,18,23],[1,29,3,34],[33,9,34,9],[55,43,55,44],[55,41,55,42],[55,33,55,34],[54,38,54,45],[55,14,56,23],[55,35,55,36],[54,30,54,37],[55,1,56,12],[35,45,35,56],[35,32,35,43],[46,5,46,7],[47,5,47,7],[48,5,48,7],[40,6,40,7],[42,5,42,12],[37,4,37,5],[37,6,37,7],[39,2,39,3],[39,6,39,7],[37,2,37,3],[42,1,42,3],[52,5,52,6],[53,20,53,23],[53,5,53,6],[23,29,23,33],[16,20,18,20],[16,21,18,21],[16,22,18,22],[14,9,14,10],[6,29,6,30],[12,14,12,18],[25,9,26,9],[27,9,28,9],[5,14,6,14],[0,10,0,12],[0,20,0,23],[14,11,14,12],[33,7,34,7],[29,9,30,9],[31,7,32,7],[35,7,36,7],[19,7,20,7],[12,20,12,23],[23,9,24,9],[19,9,20,9],[3,9,3,12],[8,15,10,16],[8,17,10,19],[4,6,4,7],[5,6,5,7],[14,6,14,8],[6,6,6,7],[23,6,24,6],[25,6,26,6],[16,9,18,9],[16,10,18,10],[16,11,18,12],[8,11,8,12]]}
[]
[null,"VFR FLIGHT LOG | VCG BE.DTO.113",null,null,1,"FLIGHT TYPE","VCG PILOT N°:",null,"TEMP",null,"FUEL TANK",{"$f":"IF(NOT(E2=1),AJ40,\"\")","v":""},{"$f":"IF(L2=\"\",\"\",L2/3.785412)","v":""},null,"To be completed by a VCG flight instructor (FI) in case of student flight",null,null,null,null,null,"Notes",null,null,null,null,null,null,null,null,"Calculations"]
[null,null,null,null,1,1,"DATE:",{"$f":"TODAY()","v":"2023-07-15"},"TAS",95,"Consumption",{"$f":"MAX('C152 Performance specs'!F33:F65,'C152 Performance specs'!I33:I65,'C152 Performance specs'!L33:L65)*3.785412","v":23.4695544},{"$f":"L3/3.785412","v":6.2},null,"Date of Flight"]
[null,{"$f":"Introduction!A5&\" | \"&Introduction!E5","v":"remarks? tony.opsomer@gmail.com | version 2023-07-15"},null,null,{"$f":"IF(AND(E3=2,LEFT(B6,2)<>LEFT(B7,2),B7<>\"\"),\"DON'T FORGET TO FILE A FLIGHTPLAN AND REGISTER THE FLIGHT BEFORE TAKEOFF!\",IF(AND(OR(E3=3,E3=2),LEFT(B6,2)=LEFT(B7,2)),\"DON'T FORGET TO REGISTER THE FLIGHT BEFORE TAKEOFF!\",\"\"))","v":""},null,null,null,"Pilot Name",null,null,null,null,null,"Name and signature\nof student pilot"]
[null,"Airfield","Gnd\nfreq","Twr / Rad freq","ATIS\nfreq","Elev","QNH",null,"W","V","RWY","Preferred RWY","RWY length",null,"Name of FI"]
[null,null,null,{"$f":"IF(B6=\"EBGB\",119.505,\"\")","v":""},null,{"$f":"IF(B6=\"EBGB\",70,\"\")","v":""},null,null,null,null,{"$f":"IF(B6=\"EBGB\",\"01-19\",\"\")","v":""},{"$f":"IF(ISERROR(AG29),\"\",AG29)","v":""},{"$f":"IF(B6=\"EBGB\",615,\"\")","v":""},null,"FI number"]
[null,null,{"$f":"IF(E3=3,C6,\"\")","v":""},{"$f":"IF(E3=3,D6,\"\")","v":""},{"$f":"IF(E3=3,E6,\"\")","v":""},{"$f":"IF(E3=3,F6,IF(B7=\"EBGB\",70,\"\"))","v":""},{"$f":"IF(E3=3,G6,IF(G6=\"\",\"\",G6))","v":""},null,{"$f":"IF(B7=B6,I6,IF(OR(AF33=0,ISERROR(AF33)),\"\",AF33))","v":0},{"$f":"IF(OR(AH33=0,ISERROR(AH33)),\"\",IF(B7=B6,J6,AH33))","v":0},{"$f":"IF(B7=\"EBGB\",\"01-19\",\"\")","v":""},{"$f":"IF(ISERROR(AG34),\"\",IF(B7=B6,L6,AG34))","v":""},{"$f":"IF(E3=3,M6,IF(B7=\"EBGB\",615,\"\"))","v":""},null,null,null,null,null,null,null,null,null,null,null,null,null,null,null,null,"dropdown list"]
[]
[null,"ALTERNATES",null,null,"Elev",null,null,null,null,null,"Elev",null,null,null,"FI signature",null,null,"A student pilot is NOT allowed to continue his/her flight when anomalies occurred or after landing at another aerodrome than originally intended  (EASA FCL.020 FCL.045)"]
[null,null,"RWY",null,"Radio\nfreq",null,null,null,"RWY",null,"Radio freq",null,null,null,"Vliegclub Grimbergen"]
[null,null,"LDA",null,null,null,null,null,"LDA",null,null,null,null,null,"BE.DTO.113"]
[]
[null,"SQWK-codes ","Standard VFR",null,"2000 if ATS\n7000 if no ATS","Hijack",7500,null,"Radio failure",null,7600,"Distress",7700,null,"Light gun signals",null,null,null,null,null,"Interception signals",null,null,null,null,null,null,null,null,1,"SELECT",null,null,1,"SELECT"]
[null,null,null,null,null,null,null,null,null,null,null,null,null,null,null,null,null,null,null,null,null,null,null,null,null,null,null,null,null,2,"OO-VCL",null,null,2,"NAV"]
[null,"NEW SQWK","0041-0057 (VFR - Bru info)",null,"NEW QNH",null,null,null,null,"TAKE-OFF TIME",null,":",null,null,null,null,null,null,null,null,null,null,null,null,null,null,null,null,null,3,"OO-BET",null,null,3,"LOC"]
{"$rows_left_out":54}
{"sheet":"Flight log FORM (REVISED)","index":2,"n_rows":68,"n_cols":59,"rows_kept":68,"cut":false,"hidden":true,"merged":[[12,21,12,24],[23,30,23,34],[25,6,26,6],[25,7,26,7],[25,9,26,9],[16,23,18,23],[16,24,18,24],[19,6,20,6],[19,7,20,7],[19,9,20,9],[21,6,22,6],[21,7,22,7],[21,9,22,9],[16,21,18,21],[16,22,18,22],[0,10,0,13],[0,21,0,24],[1,1,1,3],[1,30,3,35],[2,21,10,24],[3,1,3,3],[3,9,3,13],[3,16,3,20],[8,18,10,20],[9,4,10,4],[9,10,10,10],[4,16,4,20],[5,6,5,7],[5,15,6,15],[5,16,6,20],[6,6,6,7],[6,30,6,31],[12,2,12,3],[12,8,12,9],[12,15,12,19],[8,1,10,1],[8,2,8,3],[8,8,8,9],[8,12,8,13],[8,16,10,17],[16,1,18,1],[16,2,16,3],[16,4,18,4],[16,5,18,5],[16,6,18,6],[16,7,18,7],[14,2,14,3],[14,4,14,5],[14,12,14,13],[14,10,14,11],[16,11,18,11],[16,8,18,8],[16,9,18,9],[16,10,18,10],[16,12,18,13],[14,6,14,9],[27,6,28,6],[27,7,28,7],[27,9,28,9],[28,15,28,17],[29,6,30,6],[29,7,30,7],[29,9,30,9],[23,6,24,6],[23,7,24,7],[23,9,24,9],[35,6,36,6],[35,7,36,7],[35,9,36,9],[35,30,36,32],[35,33,35,44],[35,46,35,57],[31,6,32,6],[31,7,32,7],[31,9,32,9],[33,6,34,6],[33,7,34,7],[33,9,34,9],[49,5,49,8],[40,4,40,5],[42,1,42,3],[43,9,43,13],[37,2,37,3],[37,4,37,5],[38,4,38,5],[39,2,39,3],[39,4,39,5],[37,6,37,8],[38,6,38,8],[39,6,39,8],[40,6,40,8],[44,5,44,6],[45,5,45,6],[46,5,46,6],[47,5,47,6],[48,5,48,6],[43,5,43,6],[54,39,54,46],[55,1,56,13],[55,15,56,24],[55,34,55,35],[55,36,55,37],[55,42,55,43],[55,44,55,45],[50,5,50,8],[52,5,52,6],[53,5,53,6],[53,21,53,24],[54,31,54,38],[51,5,51,8]]}
[]
[null,"VFR FLIGHT LOG | VCG BE.DTO.113",null,null,1,"FLIGHT TYPE","VCG PILOT N°:",null,null,"TEMP",null,"FUEL TANK",{"$f":"IF(E2=1,\"\",AK40)","v":""},{"$f":"IF(M2=\"\",\"\",M2/3.785412)","v":""},null,"To be completed by a VCG flight instructor (FI) in case of student flight",null,null,null,null,null,"Notes",null,null,null,null,null,null,null,null,"Calculations"]
[null,null,null,null,1,1,"DATE:",null,{"$f":"TODAY()","v":"2023-07-15"},"TAS",95,"Consumption",{"$f":"MAX('C152 Performance specs'!F33:F65,'C152 Performance specs'!I33:I65,'C152 Performance specs'!L33:L65)*3.785412","v":23.4695544},{"$f":"M3/3.785412","v":6.2},null,"Date of Flight"]
[null,{"$f":"Introduction!A5&\" | \"&Introduction!E5","v":"remarks? tony.opsomer@gmail.com | version 2023-07-15"},null,null,{"$f":"IF(AND(E3=2,LEFT(B6,2)<>LEFT(B7,2),B7<>\"\"),\"DON'T FORGET TO FILE A FLIGHTPLAN AND REGISTER THE FLIGHT BEFORE TAKEOFF!\",IF(AND(OR(E3=3,E3=2),LEFT(B6,2)=LEFT(B7,2)),\"DON'T FORGET TO REGISTER THE FLIGHT BEFORE TAKEOFF!\",\"\"))","v":""},null,null,null,"Pilot Name",null,null,null,null,null,null,"Name and signature\nof student pilot"]
[null,"Airfield","Gnd\nfreq","Twr / Rad freq","ATIS\nfreq","Elev","QNH",null,"W","V","RWY",null,"Preferred RWY","RWY length",null,"Name of FI"]
[null,null,null,{"$f":"IF(B6=\"EBGB\",119.505,\"\")","v":""},null,{"$f":"IF(B6=\"EBGB\",70,\"\")","v":""},null,null,null,null,{"$f":"IF(B6=\"EBGB\",\"01-19\",\"\")","v":""},null,{"$f":"IF(ISERROR(AH29),\"\",AH29)","v":""},{"$f":"IF(B6=\"EBGB\",615,\"\")","v":""},null,"FI number"]
[null,{"$f":"IF(E3=3,\"EBGB\",\"\")","v":""},null,null,{"$f":"IF(E3=3,E6,\"\")","v":""},{"$f":"IF(E3=3,F6,IF(B7=\"EBGB\",70,\"\"))","v":""},{"$f":"IF(E3=3,G6,IF(G6=\"\",\"\",G6))","v":""},null,{"$f":"IF(B7=B6,I6,IF(OR(AG33=0,ISERROR(AG33)),\"\",AG33))","v":0},{"$f":"IF(OR(AI33=0,ISERROR(AI33)),\"\",IF(B7=B6,J6,AI33))","v":0},{"$f":"IF(B7=\"EBGB\",\"01-19\",\"\")","v":""},null,{"$f":"IF(ISERROR(AH34),\"\",IF(B7=B6,M6,AH34))","v":""},{"$f":"IF(E3=3,N6,IF(B7=\"EBGB\",615,\"\"))","v":""},null,null,null,null,null,null,null,null,null,null,null,null,null,null,null,null,"dropdown list"]
[]
[null,"ALTERNATES",null,null,"Elev",null,null,null,null,null,"Elev",null,null,null,null,"FI signature",null,null,"A student pilot is NOT allowed to continue his/her flight when anomalies occurred or after landing at another aerodrome than originally intended  (EASA FCL.020 FCL.045)"]
[null,null,"RWY",null,"Radio\nfreq",null,null,null,"RWY",null,"Radio freq",null,null,null,null,"Vliegclub Grimbergen"]
[null,null,"LDA",null,null,null,null,null,"LDA",null,null,null,null,null,null,"BE.DTO.113"]
[]
[null,"SQWK-codes ","Standard VFR",null,"2000 if ATS\n7000 if no ATS","Hijack",7500,null,"Radio failure",null,7600,null,"Distress",7700,null,"Light gun signals",null,null,null,null,null,"Interception signals",null,null,null,null,null,null,null,null,1,"SELECT",null,null,1,"SELECT"]
[null,null,null,null,null,null,null,null,null,null,null,null,null,null,null,null,null,null,null,null,null,null,null,null,null,null,null,null,null,null,2,"OO-VCL",null,null,2,"NAV"]
[null,"NEW SQWK","0041-0057 (VFR - Bru info)",null,"NEW QNH",null,null,null,null,null,"TAKE-OFF TIME",null,":",null,null,null,null,null,null,null,null,null,null,null,null,null,null,null,null,null,3,"OO-BET",null,null,3,"LOC"]
{"$rows_left_out":54}
{"sheet":"Performance FORM","index":3,"n_rows":89,"n_cols":24,"rows_kept":89,"cut":false,"hidden":false,"merged":[[70,17,70,18],[71,17,71,18],[72,17,72,18],[38,6,38,8],[39,6,39,8],[40,6,40,8],[41,6,41,8],[44,8,47,8],[49,6,49,8],[54,6,54,8],[50,6,50,8],[56,1,57,8],[36,1,54,1],[27,6,27,8],[4,1,22,1],[23,1,35,1],[2,14,2,15],[26,15,26,16],[18,6,18,8],[17,6,17,8],[8,6,8,8],[24,6,24,8],[12,8,15,8],[21,6,21,8],[22,6,22,8],[63,19,63,21],[63,16,63,18],[2,6,2,8],[3,6,3,8],[63,13,63,15],[9,6,9,8],[7,6,7,8],[6,6,6,8],[26,6,26,8],[25,6,25,8],[41,13,41,14],[41,15,41,16],[41,17,41,18],[26,13,26,14],[26,17,26,18],[28,6,28,8]]}
[null,null,{"$f":"Introduction!A5","v":"remarks? tony.opsomer@gmail.com"},null,null,null,null,null,{"$f":"Introduction!E5","v":"version 2023-07-15"}]
[null,null,{"$f":"\"Performance form C152\"&IF(OR(E6=0,E38=0),\"\",\" (from \"&E6&\" to \"&E38&\")\")","v":"Performance form C152"},null,null,null,null,null,"BE.DTO.113",null,null,null,"Calculations"]
[null,null,null,null,null,null,"Form validity checker",null,null,null,null,null,null,null,"RPM dropdown list items"]
[null,null,null,null,null,null,"Don't forget: always do a manual check on your data!!",null,null,null,null,null,null,null,1,"SELECT VALUE"]
[null,"TAKE-OFF","Take-off weight [kg]",null,{"$f":"IF(ISERROR(R84),\"SELECT PLANE\",R84)","v":"SELECT PLANE"},null,null,null,null,null,null,null,null,null,2,2550]
[null,null,"ICAO airport name",null,{"$f":"'Flight log FORM'!B6","v":0},null,null,null,null,null,null,null,null,null,3,2500]
[null,null,"MSL Altitude [ft]",null,{"$f":"'Flight log FORM'!F6","v":""},null,{"$f":"IF(E7=\"\",\"COMPLETE THE FORM\",\"AIRPORT ALTITUDE OK\")","v":"COMPLETE THE FORM"},null,null,null,null,null,null,null,4,2450]
[null,null,"QNH [hPa or mbar]",null,{"$f":"'Flight log FORM'!G6","v":0},null,{"$f":"IF(E8=\"\",\"COMPLETE THE FORM\",IF(OR(E8<960,E8>1100),\"INVALID QNH\",\"QNH OK\"))","v":"INVALID QNH"},null,null,null,null,null,null,null,5,2400]
[null,null,"Pressure altitude [ft]",null,{"$f":"IF(OR(E7=\"\",E8=\"\"),\"COMPLETE THE FORM\",IF(E8>1013,(E7-(E8-1013)*30),(E7+(1013-E8)*30)))","v":"COMPLETE THE FORM"},null,{"$f":"IF(OR(E9=\"\",E9=\"COMPLETE THE FORM\"),\"COMPLETE THE FORM\",IF(E9>3000,\"LEANING OF MIXTURE IS RECOMMENDED\",\"LEANING OF MIXTURE NOT RECOMMENDED\"))","v":"COMPLETE THE FORM"},null,null,null,null,null,null,null,6,2300]
[null,null,"OAT Temperature [°C]",null,{"$f":"'Flight log FORM'!J2","v":0},null,{"$f":"IF(E10=\"\",\"COMPLETE THE FORM\",IF(E10>=40,\"TEMPERATURE TOO HIGH\",\"TEMPERATURE OK\"))","v":"TEMPERATURE OK"},null,null,null,null,null,"Runway type dropdown list items",null,7,2200]
[null,null,"Density altitude [ft]",null,{"$f":"IF(OR(E8=\"\",E7=\"\",E10=\"\"),\"COMPLETE THE FORM\",E9+120*(E10-(15-(1.98/1000*E9))))","v":"COMPLETE THE FORM"},null,null,null,null,null,null,null,"DEFINE TYPE",null,8,2100]
[null,null,"Wind",null,null,null,null,null,null,null,null,null,"PAVED",null,9,2000]
[null,null,null,"Direction [°]",{"$f":"'Flight log FORM'!E20","v":""},null,{"$f":"IF(E13=\"\",\"COMPLETE THE FORM\",IF(OR(E13<0,E13>359),\"INVALID WIND DIRECTION\",\"WIND DIRECTION OK\"))","v":"COMPLETE THE FORM"},null,{"$f":"IF(OR(E13=\"\",E14=\"\",E16=\"\"),\"COMPLETE THE FORM\",IF(E14<0,\"CHECK WIND VELOCITY\",IF(ABS(O17)>=15,\"CROSSWIND TOO STRONG\",IF(R16=\"USE OTHER RUNWAY DIRECTION\",\"TOO MUCH TAILWIND, USE OTHER RUNWAY DIRECTION\",ROUND(ABS(O16),1)&\"kts \"&P16&\" AND \" & ROUND(ABS(O17),1)&\"kts \"&P17))))","v":"COMPLETE THE FORM"},null,null,null,"GRASS"]
[null,null,null,"Velocity [kts]",{"$f":"'Flight log FORM'!E21","v":""},null,{"$f":"IF(E14=\"\",\"COMPLETE THE FORM\",IF(E14<0,\"INVALID WIND VELOCITY\",\"WIND VELOCITY OK\"))","v":"COMPLETE THE FORM"}]
[null,null,"Runway",null,null,null,null,null,null,null,null,null,"Takeoff wind calculations",null,null,null,null,"change in takeoff distance"]
{"$rows_left_out":75}
{"sheet":"W&B FORM","index":4,"n_rows":46,"n_cols":24,"rows_kept":46,"cut":false,"hidden":false,"merged":[[3,4,3,6],[5,12,5,15],[10,12,11,12],[7,14,11,15],[10,5,10,6],[11,5,11,6],[9,5,9,6],[8,5,8,6],[7,5,7,6],[33,26,33,28],[33,29,33,30],[33,31,34,31],[45,1,45,15],[4,12,4,15],[25,19,25,21],[12,12,12,15],[14,12,14,15],[6,19,6,20],[16,12,16,15],[15,12,15,15]]}
[null,{"$f":"Introduction!A5","v":"remarks? tony.opsomer@gmail.com"},null,null,null,null,null,null,null,null,null,null,null,null,{"$f":"Introduction!E5","v":"version 2023-07-15"}]
[null,{"$f":"\"Weight and Balance form C152 \" &D5&\" \"&IF(OR('Performance FORM'!E6=0,'Performance FORM'!E38=0),\"\",\" (from \"&'Performance FORM'!E6&\" to \"&'Performance FORM'!E38&\")\")","v":"Weight and Balance form C152  "},null,null,null,null,null,null,null,null,null,null,null,null,null,"BE.DTO.113",null,null,null,"Calculations"]
[]
[null,"Select C152 aircraft:",null,{"$f":"'Flight log FORM'!E2","v":1}]
[null,null,null,{"$f":"IF(D4=1,\"\",IF(D4=2,\"OO-VCL\",IF(D4=3,\"OO-BET\",IF(D4=4,\"OO-VCR\",IF(D4=5,\"OO-VCM\",\"SELECT AIRPLANE\")))))","v":""},null,null,null,"Fuel quantity","Weight ","Arm","Moment",null,"Form validity checker"]
[null,null,null," ",null,null,null,"[l]","[kg]","[m]","[kg.m]",null,"Don't forget: always do a manual check on your data!!"]
[null,"Basic empty weight (includes engine oil and unusable fuel)",null,null,null,null,null,null,{"$f":"IF($D$5=\"OO-VCL\",'OO-VCL'!$C7,IF($D$5=\"OO-BET\",'OO-BET'!$C7,IF($D$5=\"OO-VCR\",'OO-VCR'!$C7,IF($D$5=\"OO-VCM\",'OO-VCM'!$C7,\"SELECT AIRPLANE\"))))","v":"SELECT AIRPLANE"},{"$f":"IF($D$5=\"OO-VCL\",'OO-VCL'!$C8,IF($D$5=\"OO-BET\",'OO-BET'!$C8,IF($D$5=\"OO-VCR\",'OO-VCR'!$C8,IF($D$5=\"OO-VCM\",'OO-VCM'!$C8,\"SELECT AIRPLANE\"))))","v":"SELECT AIRPLANE"},{"$f":"IF($D$5=\"OO-VCL\",'OO-VCL'!$C9,IF($D$5=\"OO-BET\",'OO-BET'!$C9,IF($D$5=\"OO-VCR\",'OO-VCR'!$C9,IF($D$5=\"OO-VCM\",'OO-VCM'!$C9,\"SELECT AIRPLANE\"))))","v":"SELECT AIRPLANE"},null,null,null,null,null,null,null,null,"dropdown list"]
[null,"Usable fuel ",null,"mean arm:",{"$f":"IF(OR(D5=\"OO-BET\",D5=\"OO-VCL\"),39,IF(OR(D5=\"OO-VCR\",D5=\"OO-VCM\"),42,\"SELECT AIRPLANE\"))","v":"SELECT AIRPLANE"},"inch",null,{"$f":"IF(D4=1,\"\",VLOOKUP(D5,'Flight log FORM'!AF41:'Flight log FORM'!AG44,2,FALSE))","v":""},{"$f":"IF(E8=\"SELECT AIRPLANE\",\"SELECT AIRPLANE\",IF(H8=\"\",0,H8*0.72))","v":"SELECT AIRPLANE"},{"$f":"IF(E8=\"SELECT AIRPLANE\",\"SELECT AIRPLANE\",E8*2.54/100)","v":"SELECT AIRPLANE"},{"$f":"IF(E8=\"SELECT AIRPLANE\",\"SELECT AIRPLANE\",I8*J8)","v":"SELECT AIRPLANE"},null,{"$f":"IF(OR(AND(D5<>\"OO-VCL\",D5<>\"OO-BET\",D5<>\"OO-VCR\",D5<>\"OO-VCM\"),H8=\"\"),\"COMPLETE THE FORM\",IF(H8>IF(OR(D5=\"OO-VCL\",D5=\"OO-BET\"),141.9,IF(OR(D5=\"OO-VCR\",D5=\"OO-VCM\"),92.7,)),\"FUEL TANK OVERFLOW\",\"FUEL QUANTITY WITHIN LIMIT\"))","v":"COMPLETE THE FORM"},null,{"$f":"IF(OR(AND(D5<>\"OO-VCL\",D5<>\"OO-BET\",D5<>\"OO-VCR\",D5<>\"OO-VCM\"),H8=\"\",I9=\"\",I10=\"\",I11=\"\",I12=\"\"),\"COMPLETE THE FORM\",IF(SUM(I7:I12)>MAX(U17:U21),\"TOO MUCH USEFUL LOAD\",\"TOTAL USEFUL LOAD WITHIN LIMIT\"))","v":"COMPLETE THE FORM"},null,null,null,null,1,"SELECT AIRPLANE"]
[null,"Pilot",null,"mean arm:",39,"inch",null,null,null,{"$f":"E9*2.54/100","v":0.99060000000000004},{"$f":"I9*J9","v":0},null,null,null,null,null,null,null,null,2,"OO-VCL"]
[null,"Front passenger",null,"mean arm:",39,"inch",null,null,null,{"$f":"E10*2.54/100","v":0.99060000000000004},{"$f":"I10*J10","v":0},null,null,null,null,null,null,null,null,3,"OO-BET"]
[null,"Baggage area 1",null,"mean arm:",64,"inch",null,null,null,{"$f":"E11*2.54/100","v":1.6255999999999999},{"$f":"I11*J11","v":0},null,{"$f":"IF(OR(AND(D5<>\"OO-VCL\",D5<>\"OO-BET\",D5<>\"OO-VCR\",D5<>\"OO-VCM\"),I11=\"\",I12=\"\"),\"COMPLETE THE FORM\",IF(I11>54.4,\"TOO MUCH BAGGAGE IN AREA 1\",IF(I12>18.1,\"TOO MUCH BAGGAGE IN AREA 2\",IF(SUM(I11:I12)>54.4,\"TOO MUCH BAGGAGE IN AREA 1 AND 2\",\"PARTITIONING OF BAGGAGE IN AREAS 1 AND 2 WITHIN LIMITS\"))))","v":"COMPLETE THE FORM"},null,null,null,null,null,null,4,"OO-VCR"]
[null,"Baggage area 2",null,"mean arm:",84,"inch",null,null,null,{"$f":"E12*2.54/100","v":2.1335999999999999},{"$f":"I12*J12","v":0},null,null,null,null,null,null,null,null,5,"OO-VCM"]
[null,"RAMP WEIGHT AND MOMENT",null,null,null,null,null,null,{"$f":"IF(OR(H8=\"\",I9=\"\",I10=\"\",I11=\"\",I12=\"\",I7=\"SELECT AIRPLANE\"),\"COMPLETE THE FORM\",SUM(I7:I12))","v":"COMPLETE THE FORM"},{"$f":"IF(I13=\"COMPLETE THE FORM\",\"COMPLETE THE FORM\",K13/I13)","v":"COMPLETE THE FORM"},{"$f":"IF(OR(H8=\"\",I9=\"\",I10=\"\",I11=\"\",I12=\"\",I7=\"SELECT AIRPLANE\"),\"COMPLETE THE FORM\",SUM(K7:K12))","v":"COMPLETE THE FORM"},null,{"$f":"IF(I13=\"COMPLETE THE FORM\",\"COMPLETE THE FORM\",\"CHECK RESULTS IN GRAPH BELOW\")","v":"COMPLETE THE FORM"}]
[null,"Fuel allowance for engine start, taxi and runup",null,null,null,null,null,{"$f":"'C152 Performance specs'!C74*3.785412","v":3.0283296000000002},{"$f":"H14*0.72","v":2.1803973120000002},{"$f":"IF(E8=\"SELECT AIRPLANE\",\"SELECT AIRPLANE\",E8*2.54/100)","v":"SELECT AIRPLANE"},{"$f":"IF(E8=\"SELECT AIRPLANE\",\"SELECT AIRPLANE\",I14*J14)","v":"SELECT AIRPLANE"}]
[null,"TAKE-OFF WEIGHT AND MOMENT",null,null,null,null,null,null,{"$f":"IF(OR(H8=\"\",I9=\"\",I10=\"\",I11=\"\",I12=\"\",H14=\"\",I7=\"SELECT AIRPLANE\"),\"COMPLETE THE FORM\",I13-I14)","v":"COMPLETE THE FORM"},{"$f":"IF(I15=\"COMPLETE THE FORM\",\"COMPLETE THE FORM\",K15/I15)","v":"COMPLETE THE FORM"},{"$f":"IF(OR(H8=\"\",I9=\"\",I10=\"\",I11=\"\",I12=\"\",H14=\"\",I7=\"SELECT AIRPLANE\"),\"COMPLETE THE FORM\",K13-K14)","v":"COMPLETE THE FORM"},null,{"$f":"IF(I15=\"COMPLETE THE FORM\",\"COMPLETE THE FORM\",\"CHECK RESULTS IN GRAPH BELOW\")","v":"COMPLETE THE FORM"},null,null,null,null,null,null,"graph data"]
{"$rows_left_out":32}
{"sheet":"C152 Performance specs","index":5,"n_rows":74,"n_cols":13,"rows_kept":74,"cut":false,"hidden":false,"merged":[[1,1,1,11],[4,1,5,1],[17,10,17,11],[4,2,4,3],[4,4,4,5],[4,6,4,7],[4,8,4,9],[4,10,4,11],[17,1,18,1],[2,1,2,11],[17,2,17,3],[17,4,17,5],[17,6,17,7],[17,8,17,9],[30,1,31,1],[30,2,31,2],[30,3,30,5],[30,6,30,8],[30,9,30,11]]}
[]
[null,"DATA C152*"]
[null,"* ALL DATA IS BASED ON THE CESSNA MODEL 152 HANDBOOK, 1 JULY 1978"]
[null,"TAKEOFF DISTANCE","[ft]","(assume takeoff weight of 1670 lbs = 757 kg)",null,null,null,null,null,null,"DATA FOUND ON PAGE 5-11"]
[null,"Pressure altitude [ft]","0°C",null,"10°C",null,"20°C",null,"30°C",null,"40°C"]
[null,null,"GRND ROLL","TOTAL TO CLEAR 50 FT OBS","GRND ROLL","TOTAL TO CLEAR 50 FT OBS","GRND ROLL","TOTAL TO CLEAR 50 FT OBS","GRND ROLL","TOTAL TO CLEAR 50 FT OBS","GRND ROLL","TOTAL TO CLEAR 50 FT OBS"]
[null,0,640,1190,695,1290,755,1390,810,1495,875,1605]
[null,1000,705,1310,765,1420,825,1530,890,1645,960,1770]
[null,2000,775,1445,840,1565,910,1690,980,1820,1055,1960]
[null,3000,855,1600,925,1730,1000,1870,1080,2020,1165,2185]
[null,4000,940,1775,1020,1920,1100,2080,1190,2250,1285,2440]
[null,5000,1040,1970,1125,2140,1215,2320,1315,2525,1420,2750]
[null,6000,1145,2200,1245,2395,1345,2610,1455,2855,1570,3125]
[null,7000,1270,2470,1375,2705,1490,2960,1615,3255,1745,3590]
[null,8000,1405,2800,1525,3080,1655,3395,1795,3765,1940,4195]
{"$rows_left_out":60}
{"sheet":"OO-VCL","index":6,"n_rows":67,"n_cols":15,"rows_kept":67,"cut":false,"hidden":false,"merged":[[2,1,2,5]]}
[]
[null,"DATA OO-VCL"]
[null,"LONG-RANGE FUEL TANKS"]
[null,"Max fuel quantity",37.5,"US Gal",{"$f":"C4*3.785412","v":141.95294999999999},"l"]
[null,null,null,null,null,null,null,null,null,null,null,null,null,"BASED ON"]
[null,"W&B DATA"]
[null,"Empty Weight",{"$f":"L7*0.45359237","v":587.46562208180012},"kg",null,null,null,null,null,null,null,1295.1400000000001,"lbs"]
[null,"Arm",{"$f":"L8*0.0254","v":0.81424780000000008},"m",null,null,null,null,null,null,null,32.057000000000002,"in"]
[null,"Moment ",{"$f":"L9*0.45359237*0.0254","v":478.33471235801181},"m.kg",null,null,null,null,null,null,null,41517.619200000001,"in.lbs"]
[]
[null,"Max Useful load",{"$f":"L11*0.45359237","v":170.03363581820003},"kg",null,null,null,null,null,null,null,374.86,"lbs"]
[null,"(normal category)"]
[]
[null,"W&B Center of Gravity limits graph"]
[null,"arm [m]","weight [kg]"]
{"$rows_left_out":53}
{"sheet":"OO-BET","index":7,"n_rows":67,"n_cols":15,"rows_kept":67,"cut":false,"hidden":false,"merged":[[2,1,2,5]]}
[]
[null,"DATA OO-BET"]
[null,"LONG-RANGE FUEL TANKS"]
[null,"Max fuel quantity",37.5,"US Gal",{"$f":"C4*3.785412","v":141.95294999999999},"l"]
[null,null,null,null,null,null,null,null,null,null,null,null,"BASED ON"]
[null,"W&B DATA"]
[null,"Empty Weight",{"$f":"L7*0.45359237","v":536.47730377009998},"kg",null,null,null,null,null,null,null,1182.73,"lbs"]
[null,"Arm",{"$f":"L8*0.0254","v":0.79286099999999993},"m",null,null,null,null,null,null,null,31.215,"in"]
[null,"Moment ",{"$f":"L9*0.45359237*0.0254","v":425.35441955758165},"m.kg",null,null,null,null,null,null,null,36919.132899999997,"in.lbs"]
[]
[null,"Max Useful load",{"$f":"L11*0.45359237","v":221.0219541299},"kg",null,null,null,null,null,null,null,487.27,"lbs"]
[null,"(normal category)"]
[]
[null,"W&B Center of Gravity limits graph"]
[null,"arm [m]","weight [kg]"]
{"$rows_left_out":53}
{"sheet":"OO-VCR","index":8,"n_rows":67,"n_cols":15,"rows_kept":67,"cut":false,"hidden":false,"merged":[[2,1,2,5]]}
[]
[null,"DATA OO-VCR"]
[null,"STANDARD RANGE FUEL TANKS"]
[null,"Max fuel quantity",24.5,"US Gal",{"$f":"C4*3.785412","v":92.742593999999997},"l"]
[null,null,null,null,null,null,null,null,null,null,null,null,null,"BASED ON"]
[null,"W&B DATA"]
[null,"Empty Weight",{"$f":"L7*0.45359237","v":538.64547529870003},"kg",null,null,null,null,null,null,null,1187.51,"lbs"]
[null,"Arm",{"$f":"L8*0.0254","v":0.7847329999999999},"m",null,null,null,null,null,null,null,30.895,"in"]
[null,"Moment ",{"$f":"L9*0.45359237*0.0254","v":422.69043438306932},"m.kg",null,null,null,null,null,null,null,36687.909200000002,"in.lbs"]
[]
[null,"Max Useful load",{"$f":"L11*0.45359237","v":218.85378260130003},"kg",null,null,null,null,null,null,null,482.49,"lbs"]
[null,"(utility category)"]
[]
[null,"W&B Center of Gravity limits graph"]
[null,"arm [m]","weight [kg]"]
{"$rows_left_out":53}
{"sheet":"OO-VCM","index":9,"n_rows":67,"n_cols":15,"rows_kept":67,"cut":false,"hidden":false,"merged":[[2,1,2,5]]}
[]
[null,"DATA OO-VCM"]
[null,"STANDARD RANGE FUEL TANKS"]
[null,"Max fuel quantity",24.5,"US Gal",{"$f":"C4*3.785412","v":92.742593999999997},"l"]
[]
[null,"W&B DATA",null,null,null,null,null,"BASED ON"]
[null,"Empty Weight",{"$f":"J7*0.45359237","v":537.88797604080003},"kg",null,null,null,null,null,1185.8399999999999,"lbs"]
[null,"Arm",{"$f":"J8*0.0254","v":0.77876400000000001},"m",null,null,null,null,null,30.66,"in"]
[null,"Moment ",{"$f":"J9*0.45359237*0.0254","v":418.85847711461139},"m.kg",null,null,null,null,null,36355.31,"in.lbs"]
[]
[null,"Max Useful load",{"$f":"J11*0.45359237","v":219.61128185920003},"kg",null,null,null,null,null,484.16,"lbs"]
[null,"(normal category)"]
[]
[null,"W&B Center of Gravity limits graph"]
[null,"arm [m]","weight [kg]"]
{"$rows_left_out":52}