{"text_format":"1","workbook":"xlsx","n_sheets":5,"sheets":["Introduction","Flight log FORM","Performance FORM","W&B FORM","Aquila performance specs"],"not_rendered":{"charts":11,"images":8,"macros":1,"external_links":0,"defined_names":5,"comments":2,"pivot_tables":0},"unopened":[],"bounds":{"document_bytes":16777216,"sheet_cells":100000,"rows_first":2000,"rows_last":500,"rows_between":2000,"halvings":0,"cell_chars":16384,"cell_head_chars":4096},"cells_cut":0,"cells_raw":0,"read":"whole","date_system":"1900"}

{"sheet":"Introduction","index":0,"n_rows":12,"n_cols":8,"rows_kept":12,"cut":false,"hidden":false,"merged":[[3,0,3,7],[5,1,7,1],[10,0,10,7],[11,0,11,7]]}
[]
["remarks? tony.opsomer@gmail.com",null,null,null,null,null,null,"version 2023-07-15"]
[]
["D-EVIE | Aquila A210"]
[]
[null,"A210","Flight log form"]
[null,null,"Performance form"]
[null,null,"Weight and balance form"]
[]
[]
["Vliegclub Grimbergen BE.DTO.113"]
["download the latest version from https://goahead.classy.be/weight-balance/ "]

{"sheet":"Flight log FORM","index":1,"n_rows":68,"n_cols":58,"rows_kept":68,"cut":false,"hidden":false,"merged":[[52,5,52,6],[43,9,43,12],[39,4,39,5],[40,4,40,5],[38,4,38,5],[38,6,38,7],[43,5,43,7],[50,5,50,8],[16,2,16,3],[16,8,18,8],[16,5,18,5],[21,6,22,6],[33,6,34,6],[39,2,39,3],[29,7,30,7],[27,7,28,7],[35,6,36,6],[1,1,1,3],[12,2,12,3],[16,1,18,1],[14,2,14,3],[3,1,3,3],[16,4,18,4],[9,4,10,4],[3,4,3,7],[44,5,44,7],[1,29,3,34],[33,9,34,9],[55,43,55,44],[55,41,55,42],[55,33,55,34],[54,38,54,45],[55,14,56,23],[55,35,55,36],[54,30,54,37],[55,1,56,12],[2,20,10,23],[3,15,3,19],[4,15,4,19],[5,15,6,19],[23,7,24,7],[25,7,26,7],[21,7,22,7],[9,10,10,10],[16,23,18,23],[16,20,18,20],[35,9,36,9],[31,9,32,9],[21,9,22,9],[35,29,36,31],[53,20,53,23],[53,5,53,6],[23,29,23,33],[27,9,28,9],[35,7,36,7],[23,6,24,6],[25,6,26,6],[35,45,35,56],[35,32,35,43],[46,5,46,7],[47,5,47,7],[48,5,48,7],[40,6,40,7],[42,5,42,12],[37,4,37,5],[37,6,37,7],[39,6,39,7],[28,14,28,16],[31,6,32,6],[29,6,30,6],[27,6,28,6],[45,5,45,7],[49,5,49,8],[51,9,53,12],[6,29,6,30],[12,14,12,18],[25,9,26,9],[5,14,6,14],[16,9,18,9],[16,10,18,10],[16,11,18,12],[37,2,37,3],[42,1,42,3],[14,4,14,5],[19,6,20,6],[8,5,8,6],[8,8,8,9],[8,2,8,3],[8,1,10,1],[12,8,12,9],[16,6,18,6],[16,7,18,7],[0,20,0,23],[14,11,14,12],[33,7,34,7],[29,9,30,9],[31,7,32,7],[19,7,20,7],[12,20,12,23],[23,9,24,9],[19,9,20,9],[16,21,18,21],[16,22,18,22],[14,9,14,10],[3,9,3,12],[8,15,10,16],[8,17,10,19],[4,6,4,7],[5,6,5,7],[14,6,14,8],[6,6,6,7],[8,11,8,12],[0,10,0,12]]}
[]
[null,"VFR FLIGHT LOG | VCG BE.DTO.113",null,null,"D-EVIE","FLIGHT TYPE","VCG PILOT N°:",null,"TEMP",null,"FUEL TANK",{"$f":"IF(E2=1,\"\",AJ40)","v":109.6},{"$f":"IF(L2=\"\",\"\",ROUND(L2/3.785412,2))","v":28.95},null,"To be completed by a VCG flight instructor (FI) in case of student flight",null,null,null,null,null,"Notes",null,null,null,null,null,null,null,null,"Calculations"]
[null,null,null,null,1,1,"DATE:",{"$f":"TODAY()","v":"2023-07-15"},"TAS",107,"Consumption",{"$f":"MAX('Aquila performance specs'!I6:I12)","v":22},{"$f":"ROUND(L3/3.785412,2)","v":5.81},null,"Date of Flight"]
[null,{"$f":"Introduction!A2&\" | \"&Introduction!H2","v":"remarks? tony.opsomer@gmail.com | version 2023-07-15"},null,null,{"$f":"IF(AND(E3=2,LEFT(B6,2)<>LEFT(B7,2),B7<>\"\"),\"DON'T FORGET TO FILE A FLIGHTPLAN AND REGISTER THE FLIGHT BEFORE TAKEOFF!\",IF(AND(OR(E3=3,E3=2),LEFT(B6,2)=LEFT(B7,2)),\"DON'T FORGET TO REGISTER THE FLIGHT BEFORE TAKEOFF!\",\"\"))","v":""},null,null,null,"Pilot Name",null,null,null,null,null,"Name and signature\nof student pilot"]
[null,"Airfield","Gnd\nfreq","Twr / Rad freq","ATIS\nfreq","Elev","QNH",null,"W","V","RWY","Preferred RWY","RWY length",null,"Name of FI"]
[null,null,null,{"$f":"IF(B6=\"EBGB\",119.505,\"\")","v":""},null,{"$f":"IF(B6=\"EBGB\",70,\"\")","v":""},null,null,null,null,{"$f":"IF(B6=\"EBGB\",\"01-19\",\"\")","v":""},{"$f":"IF(ISERROR(AG29),\"\",AG29)","v":""},{"$f":"IF(B6=\"EBGB\",615,\"\")","v":""},null,"FI number"]
[null,{"$f":"IF(E3=3,B6,\"\")","v":""},{"$f":"IF(E3=3,C6,\"\")","v":""},{"$f":"IF(E3=3,D6,\"\")","v":""},{"$f":"IF(E3=3,E6,\"\")","v":""},{"$f":"IF(E3=3,F6,IF(B7=\"EBGB\",70,\"\"))","v":""},{"$f":"IF(E3=3,G6,IF(G6=\"\",\"\",G6))","v":""},null,{"$f":"IF(B7=B6,I6,IF(OR(AF33=0,ISERROR(AF33)),\"\",AF33))","v":0},{"$f":"IF(OR(AH33=0,ISERROR(AH33)),\"\",IF(B7=B6,J6,AH33))","v":0},{"$f":"IF(B7=\"EBGB\",\"01-19\",\"\")","v":""},{"$f":"IF(ISERROR(AG34),\"\",IF(B7=B6,L6,AG34))","v":""},{"$f":"IF(E3=3,M6,IF(B7=\"EBGB\",615,\"\"))","v":""},null,null,null,null,null,null,null,null,null,null,null,null,null,null,null,null,"dropdown list"]
[]
[null,"ALTERNATES",null,null,"Elev",null,null,null,null,null,"Elev",null,null,null,"FI signature",null,null,"A student pilot is NOT allowed to continue his/her flight when anomalies occurred or after landing at another aerodrome than originally intended  (EASA FCL.020 FCL.045)"]
[null,null,"RWY",null,"Radio\nfreq",null,null,null,"RWY",null,"Radio freq",null,null,null,"Vliegclub Grimbergen"]
[null,null,"LDA",null,null,null,null,null,"LDA",null,null,null,null,null,"BE.DTO.113"]
[]
[null,"SQWK-codes ","Standard VFR",null,"2000 if ATS\n7000 if no ATS","Hijack",7500,null,"Radio failure",null,7600,"Distress",7700,null,"Light gun signals",null,null,null,null,null,"Interception signals",null,null,null,null,null,null,null,null,null,null,null,null,1,"SELECT"]
[null,null,null,null,null,null,null,null,null,null,null,null,null,null,null,null,null,null,null,null,null,null,null,null,null,null,null,null,null,null,null,null,null,2,"NAV"]
[null,"NEW SQWK","0041-0057 (VFR - Bru info)",null,"NEW QNH",null,null,null,null,"TAKE-OFF TIME",null,":",null,null,null,null,null,null,null,null,null,null,null,null,null,null,null,null,null,null,null,null,null,3,"LOC"]
[]
[null,"From / To","VOR ",null,"W / V","Rv/\nVar","Cm","Cc","DIST / \nCruise ALT","GS","EET / \nTOT EET","Enroute radio / Frequency"]
[null,null,"Name","Bearing",null,null,null,null,null,null,null,null,null,null,null,null,null,null,null,null,null,null,null,null,null,null,null,null,null,null,null,null,null,1,"SELECT"]
[null,null,"Freq","TO/FROM",null,null,null,null,null,null,null,null,null,null,null,null,null,null,null,null,null,null,null,null,null,null,null,null,null,null,null,null,null,2,"DAY"]
[{"$f":"IF(B21=$B$7,$B$7,\"\")","v":""},{"$f":"IF(B6=\"\",\"\",B6)","v":""},null,null,{"$f":"IF(I6=\"\",\"\",I6)","v":""},null,{"$f":"IF(OR(F20<0,F20>359,F20=\"\",F21=\"\"),\"\",IF((ROUND(((180/PI())*(((PI()/180)*F20)+SIN((E21/$J$3)*(SIN(((PI()/180)*E20)-((PI()/180)*F20)))))-F21),0))>=360,ROUND(((180/PI())*(((PI()/180)*F20)+SIN((E21/$J$3)*(SIN(((PI()/180)*E20)-((PI()/180)*F20))))))-F21,0)-360,IF((ROUND(((180/PI())*(((PI()/180)*F20)+SIN((E21/$J$3)*(SIN(((PI()/180)*E20)-((PI()/180)*F20)))))-F21),0))<0,ROUND(((180/PI())*(((PI()/180)*F20)+SIN((E21/$J$3)*(SIN(((PI()/180)*E20)-((PI()/180)*F20)))))-F21),0)+360,ROUND(((180/PI())*(((PI()/180)*F20)+SIN((E21/$J$3)*(SIN(((PI()/180)*E20)-((PI()/180)*F20)))))-F21),0))))","v":""},{"$f":"IF(OR(F20<0,F20>359,F20=\"\",F21=\"\"),\"\",IF((ROUND(((180/PI())*(((PI()/180)*F20)+SIN((E21/$J$3)*(SIN(((PI()/180)*E20)-((PI()/180)*F20)))))-F21-AL57),0))>=360,ROUND(((180/PI())*(((PI()/180)*F20)+SIN((E21/$J$3)*(SIN(((PI()/180)*E20)-((PI()/180)*F20))))))-F21-AL57,0)-360,IF((ROUND(((180/PI())*(((PI()/180)*F20)+SIN((E21/$J$3)*(SIN(((PI()/180)*E20)-((PI()/180)*F20)))))-F21-AL57),0))<0,ROUND(((180/PI())*(((PI()/180)*F20)+SIN((E21/$J$3)*(SIN(((PI()/180)*E20)-((PI()/180)*F20)))))-F21-AL57),0)+360,ROUND(((180/PI())*(((PI()/180)*F20)+SIN((E21/$J$3)*(SIN(((PI()/180)*E20)-((PI()/180)*F20)))))-F21-AL57),0))))","v":""},null,{"$f":"IF(OR(F20<0,F20>359,F20=\"\"),\"\",ROUND($J$3*SQRT((1-((($E21/$J$3)*(SIN(((PI()/180)*$E20)-((PI()/180)*F20))))^2)))-($E21*COS(((PI()/180)*$E20)-((PI()/180)*F20))),0))","v":""},{"$f":"IF(OR(I20=0,I20=\"\",F20=\"\"),\"\",ROUND(((I20/J20)*60),1))","v":""},null,null,null,null,null,null,null,null,null,null,null,null,null,null,null,null,null,null,null,null,null,null,3,"NIGHT"]
{"$rows_left_out":49}
{"sheet":"Performance FORM","index":2,"n_rows":186,"n_cols":28,"rows_kept":186,"cut":false,"hidden":false,"merged":[[0,1,0,3],[25,6,25,8],[6,6,6,8],[14,8,17,8],[170,18,171,18],[4,12,5,14],[4,6,4,8],[5,6,5,8],[10,6,10,8],[8,6,8,8],[20,6,21,8],[7,6,7,8],[24,1,34,1],[6,1,23,1],[19,6,19,8],[9,6,9,8],[170,19,171,21],[170,22,171,22],[174,19,174,23],[22,6,23,8],[22,13,22,14],[53,1,54,8],[26,6,26,8],[24,15,24,17],[24,13,25,13],[24,14,25,14],[29,6,29,8],[27,6,27,8],[28,6,28,8],[31,6,34,8],[49,6,49,8],[36,6,36,8],[24,6,24,8],[35,1,51,1],[35,6,35,8],[38,6,38,8],[37,6,37,8],[42,8,45,8],[50,6,51,8],[47,6,47,8],[48,6,48,8],[39,6,39,8]]}
[null,{"$f":"Introduction!A2","v":"remarks? tony.opsomer@gmail.com"},null,null,null,null,null,null,{"$f":"Introduction!H2","v":"version 2023-07-15"}]
[null,"Performance form D-EVIE",null,null,null,null,null,null,"BE.DTO.113"]
[]
[]
[null,null,null,null,null,null,"Form validity checker",null,null,null,null,null,"Calculations"]
[null,null,null,null,null,null,"Don't forget: always do a manual check on your data!!"]
[null,"TAKE-OFF","Take-off mass [kg]",null,null,null,{"$f":"IF(E7=\"\",\"COMPLETE THE FORM\",IF(OR(E7<550,E7>'Aquila performance specs'!C134),\"WEIGHT OUT OF LIMITS\",\"WEIGHT VALUE OK\"))","v":"COMPLETE THE FORM"}]
[null,null,"Airport MSL altitude [ft]",null,null,null,{"$f":"IF(E8=\"\",\"COMPLETE THE FORM\",\"AIRPORT ALTITUDE OK\")","v":"COMPLETE THE FORM"},null,null,null,null,null,"Runway type dropdown list items",null,null,"Humidity dropdown list"]
[null,null,"Airport QNH [hPa or mbar]",null,null,null,{"$f":"IF(E9=\"\",\"COMPLETE THE FORM\",IF(OR(E9<960,E9>1100),\"INVALID QNH\",\"QNH OK\"))","v":"COMPLETE THE FORM"},null,null,null,null,null,"DEFINE TYPE",null,null,"SELECT VALUE"]
[null,null,"Airport pressure altitude [ft]",null,{"$f":"IF(OR(E8=\"\",E9=\"\"),\"COMPLETE THE FORM\",IF(E9>1013,(E8-(E9-1013)*30),(E8+(1013-E9)*30)))","v":"COMPLETE THE FORM"},null,{"$f":"IF(OR(E10=\"\",E10=\"COMPLETE THE FORM\"),\"COMPLETE THE FORM\",IF(E10>8000,\"NO DATA AVAILABLE\",\"PRESSURE ALTITUDE OK\"))","v":"COMPLETE THE FORM"},null,null,null,null,null,"PAVED",null,null,"LOW"]
[null,null,"OAT Temperature at airport [°C]",null,null,null,{"$f":"IF(E11=\"\",\"COMPLETE THE FORM\",IF(OR(E11>40,E11<-30),\"TEMPERATURE OUT OF DATA RANGE\",\"TEMPERATURE OK\"))","v":"COMPLETE THE FORM"},null,null,null,null,null,"DRY GRASS",null,null,"HIGH"]
[null,null,"Air humidity at airport",null,1,null,null,null,null,null,null,null,"SOFT GRASS"]
[null,null,"Airport density altitude [ft]",null,{"$f":"IF(OR(E9=\"\",E8=\"\",E11=\"\"),\"COMPLETE THE FORM\",E10+120*(E11-(15-(1.98/1000*E10))))","v":"COMPLETE THE FORM"},null,null,null,null,null,null,null,"MCP dropdown list items"]
[null,null,"Wind at airport",null,null,null,null,null,null,null,null,1,"SELECT VALUE"]
[null,null,null,"Direction [°]",null,null,{"$f":"IF(E15=\"\",\"COMPLETE THE FORM\",IF(OR(E15<0,E15>359),\"INVALID WIND DIRECTION\",\"WIND DIRECTION OK\"))","v":"COMPLETE THE FORM"},null,{"$f":"IF(OR(E15=\"\",E16=\"\",E18=\"\"),\"COMPLETE THE FORM\",IF(E16<0,\"CHECK WIND VELOCITY\",IF(ABS(Q45)>15,\"CROSSWIND TOO STRONG\",IF(Q44<-10,\"TOO MUCH TAILWIND, USE OTHER RUNWAY DIRECTION\",IF(Q44>20,\"TOO MUCH HEADWIND\",ROUND(ABS(Q44),1)&\"kts \"&R44&\" AND \"&ROUND(ABS(Q45),1)&\"kts crosswind\")))))","v":"COMPLETE THE FORM"},null,null,2,0.55000000000000004]
[null,null,null,"Velocity [kts]",null,null,{"$f":"IF(E16=\"\",\"COMPLETE THE FORM\",IF(E16<0,\"INVALID WIND VELOCITY\",\"WIND VELOCITY OK\"))","v":"COMPLETE THE FORM"},null,null,null,null,3,0.65]
[null,null,"Runway in use",null,null,null,null,null,null,null,null,4,0.75]
[null,null,null,"QFU",null,null,{"$f":"IF(E18=\"\",\"COMPLETE THE FORM\",IF(OR(E18<0,E18>35),\"INVALID QFU\",\"QFU OK\"))","v":"COMPLETE THE FORM"},null,null,null,null,5,0.85]
[null,null,null,"type",1,null,{"$f":"IF(E19=\"\",\"\",IF(E19=1,\"DEFINE TYPE\",IF(E19=2,\"PAVED\",IF(E19=3,\"DRY GRASS\",IF(E19=4,\"SOFT GRASS\")))))","v":"DEFINE TYPE"},null,null,null,null,6,"MCP"]
[null,null,null,"length [m]",null,null,{"$f":"IF(E20=\"\",\"COMPLETE THE FORM\",IF(E20<0,\"INVALID RUNWAY LENGTH VALUE\",\"RUNWAY LENGTH VALUE OK\"))","v":"COMPLETE THE FORM"}]
{"$rows_left_out":167}
{"sheet":"W&B FORM","index":3,"n_rows":46,"n_cols":29,"rows_kept":46,"cut":false,"hidden":false,"merged":[[27,25,28,25],[7,5,7,6],[4,19,5,21],[8,5,8,6],[1,4,1,6],[4,12,4,15],[5,12,5,15],[6,19,6,20],[27,23,27,24],[9,5,9,6],[10,5,10,6],[7,14,10,15],[45,1,45,15],[11,12,11,15],[13,12,13,15],[14,12,14,15],[15,12,15,15],[17,1,42,1],[43,1,43,15]]}
[null,{"$f":"Introduction!A2","v":"remarks? tony.opsomer@gmail.com"},null,null,null,null,null,null,null,null,null,null,null,null,{"$f":"Introduction!H2","v":"version 2023-07-15"}]
[]
[null,"Weight & balance form  D-EVIE",null,null,null,null,null,null,null,null,null,null,null,null,null,"BE.DTO.113"]
[]
[null,null,null,null,null,null,null,"Fuel quantity","Weight ","Arm","Moment",null,"Form validity checker",null,null,null,null,null,null,"Calculations"]
[null,null,null,null,null,null,null,"[l]","[kg]","[m]","[kg.m]",null,"Don't forget: always do a manual check on your data!!"]
[null,"Basic empty weight (includes brake fluid, eng. oil & coolant and 10,4 l unusable fuel)",null,null,null,null,null,null,{"$f":"'Aquila performance specs'!C135","v":505},{"$f":"K7/I7","v":0.43354455445544554},{"$f":"'Aquila performance specs'!H135","v":218.94}]
[null,"Usable fuel (max. 109,60 l) ",null,null,null,null,null,null,{"$f":"H8*0.72","v":0},0.32500000000000001,{"$f":"I8*J8","v":0},null,{"$f":"IF(H8=\"\",\"COMPLETE THE FORM\",IF(H8>109.6,\"FUEL TANK OVERFLOW\",\"FUEL QUANTITY WITHIN LIMIT\"))","v":"COMPLETE THE FORM"},null,{"$f":"IF(OR(H8=\"\",I9=\"\",I10=\"\",I11=\"\"),\"COMPLETE THE FORM\",IF(SUM(I7:I11)>'Aquila performance specs'!C134,\"TOO MUCH USEFUL LOAD\",\"TOTAL USEFUL LOAD WITHIN LIMIT\"))","v":"COMPLETE THE FORM"}]
[null,"Pilot","forward position",5145,null,"rearward position",null,null,null,{"$f":"D9/10000","v":0.51449999999999996},{"$f":"I9*J9","v":0},null,null,null,null,null,null,null,null,"Aquila approved centre of gravity range and mass moment limits",null,null,null,null,null,"xS1=",0.42699999999999999,"xS2=",0.52300000000000002]
[null,"Passenger","forward position",5149,null,"rearward position",null,null,null,{"$f":"D10/10000","v":0.51490000000000002},{"$f":"I10*J10","v":0}]
[null,"Baggage area",null,null,null,null,null,null,null,1.3,{"$f":"I11*J11","v":0},null,{"$f":"IF(I11=\"\",\"COMPLETE THE FORM\",IF(I11>40,\"TOO MUCH BAGGAGE\",\"BAGGAGE VALUE OK\"))","v":"COMPLETE THE FORM"},null,null,null,null,null,null,"X",{"$f":"U12*AA9","v":215.63499999999999},{"$f":"U12*AC9","v":264.11500000000001},{"$f":"W12*AA9","v":320.25},{"$f":"X12*AC9","v":392.25},{"$f":"U11","v":215.63499999999999},{"$f":"W11","v":320.25},{"$f":"V11","v":264.11500000000001},{"$f":"X11","v":392.25}]
[null,"RAMP WEIGHT AND MOMENT",null,null,null,null,null,null,{"$f":"IF(OR(H8=\"\",I9=\"\",I10=\"\",I11=\"\"),\"NO DATA\",SUM(I7:I11))","v":"NO DATA"},{"$f":"IF(OR(H8=\"\",I9=\"\",I10=\"\",I11=\"\"),\"NO DATA\",K12/I12)","v":"NO DATA"},{"$f":"IF(OR(H8=\"\",I9=\"\",I10=\"\",I11=\"\"),\"NO DATA\",SUM(K7:K11))","v":"NO DATA"},null,{"$f":"IF(I12=\"NO DATA\",\"COMPLETE THE FORM\",IF(AND(I12<='Aquila performance specs'!C134,Z30=\"YES\"),\"RAMP WEIGHT AND MOMENT WITHIN LIMITS\",IF(I12>'Aquila performance specs'!C134,\"DANGER: RAMP WEIGHT OUT OF LIMIT\",IF(AND('W&B FORM'!I12<='Aquila performance specs'!C134,Z30=\"NO\"),\"DANGER: RAMP MOMENT OUT OF LIMIT\"))))","v":"COMPLETE THE FORM"},null,null,null,null,null,null,"Y",{"$f":"'Aquila performance specs'!C135","v":505},{"$f":"U12","v":505},{"$f":"'Aquila performance specs'!C134","v":750},{"$f":"W12","v":750},{"$f":"U12","v":505},{"$f":"W12","v":750},{"$f":"V12","v":505},{"$f":"X12","v":750}]
[null,"Fuel allowance for engine start, taxi and runup",null,null,null,null,null,3,{"$f":"H13*0.72","v":2.16},{"$f":"J8","v":0.32500000000000001},{"$f":"IF(E8=\"SELECT AIRPLANE\",\"SELECT AIRPLANE\",I13*J13)","v":0.70200000000000007}]
[null,"TAKE-OFF WEIGHT AND MOMENT",null,null,null,null,null,null,{"$f":"IF(OR(H8=\"\",I9=\"\",I10=\"\",I11=\"\",H13=\"\"),\"NO DATA\",I12-I13)","v":"NO DATA"},{"$f":"IF(OR(H8=\"\",I9=\"\",I10=\"\",I11=\"\",H13=\"\"),\"NO DATA\",K14/I14)","v":"NO DATA"},{"$f":"IF(OR(H8=\"\",I9=\"\",I10=\"\",I11=\"\",H13=\"\"),\"NO DATA\",K12-K13)","v":"NO DATA"},null,{"$f":"IF(I14=\"NO DATA\",\"COMPLETE THE FORM\",IF(AND(I14<='Aquila performance specs'!C134,Z31=\"YES\"),\"TAKE-OFF WEIGHT AND MOMENT WITHIN LIMITS\",IF(I14>'Aquila performance specs'!C134,\"DANGER: TAKE-OFF WEIGHT OUT OF LIMIT\",IF(AND('W&B FORM'!I14<='Aquila performance specs'!C134,Z31=\"NO\"),\"DANGER: TAKE-OFF MOMENT OUT OF LIMIT\"))))","v":"COMPLETE THE FORM"}]
[null,"Total trip time",null,null,null,"hh:mm",null,{"$f":"(HOUR(E15)*60+MINUTE(E15))/60*MAX('Aquila performance specs'!F6:F12,'Aquila performance specs'!I6:I12,'Aquila performance specs'!L6:L12,'Aquila performance specs'!O6:O12,'Aquila performance specs'!R6:R12)","v":0},{"$f":"H15*0.72","v":0},{"$f":"J8","v":0.32500000000000001},{"$f":"I15*J15","v":0},null,{"$f":"IF(I14=\"NO DATA\",\"COMPLETE THE FORM\",IF(H15<(H8-(26*45/60)),\"TRIP TIME WITHIN LIMIT\",IF(H15<H8,\"DANGER! DANGER! FUEL RESERVE LESS THAN 45 MIN\",\"TRIP TIME TOO BIG\")))","v":"COMPLETE THE FORM"},null,null,null,null,null,null,"dotted lines to calculated points"]
[null,"LANDING WEIGHT AND MOMENT",null,null,null,null,null,null,{"$f":"IF(OR(H8=\"\",I9=\"\",I10=\"\",I11=\"\",E15=\"\",H13=\"\"),\"NO DATA\",IF(M15=\"TRIP TIME TOO BIG\",\"CHECK\",I14-I15))","v":"NO DATA"},{"$f":"IF(OR(H8=\"\",I9=\"\",I10=\"\",I11=\"\",E15=\"\",H13=\"\"),\"NO DATA\",IF(M15=\"TRIP TIME TOO BIG\",\"TRIP\",K16/I16))","v":"NO DATA"},{"$f":"IF(OR(H8=\"\",I9=\"\",I10=\"\",I11=\"\",E15=\"\",H13=\"\"),\"NO DATA\",IF(M15=\"TRIP TIME TOO BIG\",\"TIME\",K14-K15))","v":"NO DATA"},null,{"$f":"IF(I16=\"NO DATA\",\"COMPLETE THE FORM\",IF(AND(I16<='Aquila performance specs'!C134,Z32=\"YES\"),\"RAMP WEIGHT AND MOMENT WITHIN LIMITS\",IF(I16>'Aquila performance specs'!C134,\"DANGER: LANDING WEIGHT OUT OF LIMIT\",IF(AND('W&B FORM'!I16<='Aquila performance specs'!C134,Z32=\"NO\"),\"DANGER: LANDING MOMENT OUT OF LIMIT\"))))","v":"COMPLETE THE FORM"},null,null,null,null,null,null,null,"X",210,{"$f":"K12","v":"NO DATA"},{"$f":"W16","v":"NO DATA"},{"$f":"X16","v":"NO DATA"}]
[null,null,null,null,null,null,null,null,null,null,null,null,null,null,null,null,null,null,null,null,"Y",{"$f":"I12","v":"NO DATA"},{"$f":"I12","v":"NO DATA"},{"$f":"W17","v":"NO DATA"},0]
[null,"Mass [kg]"]
[null,null,null,null,null,null,null,null,null,null,null,null,null,null,null,null,null,null,null,null,"X",{"$f":"V16","v":210},{"$f":"K14","v":"NO DATA"},{"$f":"W19","v":"NO DATA"},{"$f":"W19","v":"NO DATA"}]
[null,null,null,null,null,null,null,null,null,null,null,null,null,null,null,null,null,null,null,null,"Y",{"$f":"I14","v":"NO DATA"},{"$f":"V20","v":"NO DATA"},{"$f":"W20","v":"NO DATA"},0]
{"$rows_left_out":27}
{"sheet":"Aquila performance specs","index":4,"n_rows":218,"n_cols":25,"rows_kept":218,"cut":false,"hidden":false,"merged":[[91,1,92,28],[196,1,216,1],[217,2,217,15],[145,1,146,22],[193,1,194,18],[182,1,182,6],[148,18,148,21],[151,1,172,1],[148,10,148,11],[148,12,148,13],[148,14,148,17],[139,6,140,7],[173,2,173,21],[148,2,148,5],[148,6,148,9],[139,10,140,11],[55,7,55,13],[74,1,74,3],[74,8,74,9],[33,1,34,28],[16,22,16,23],[16,1,16,3],[16,8,16,9],[74,22,74,23],[70,1,70,6],[70,21,70,27],[55,14,55,20],[74,16,74,19],[113,1,113,6],[113,7,113,13],[113,14,113,20],[128,13,128,20],[2,1,4,1],[2,3,2,17],[3,3,3,5],[70,13,70,20],[70,7,70,12],[3,6,3,8],[2,2,4,2],[3,9,3,11],[3,12,3,14],[3,15,3,17],[16,16,16,19],[55,1,55,6],[139,2,140,3],[128,1,128,6],[128,7,128,12],[139,14,140,15],[128,21,128,27]]}
["Based on the original Aquila information dated 2008/09/17, document FM-AT01-1010-100E, issue A.12"]
[null,"Cruise power settings"]
[null,"Press alt [ft]","Temp ISA [°C]","Cruise power - % of the maximum countinous power MCP"]
[null,null,null,0.55000000000000004,null,null,0.65,null,null,0.75,null,null,0.85,null,null,"MCP"]
[null,null,null,"RPM","MAP [in Hg]","F/F [l/h]","RPM","MAP [in Hg]","F/F [l/h]","RPM","MAP [in Hg]","F/F [l/h]","RPM","MAP [in Hg]","F/F [l/h]","RPM","MAP [in Hg]","F/F [l/h]"]
[null,0,15,1900,24.6,14,2000,25.7,15.6,2100,27,21,2260,27.7,24,2260,28,26]
[null,2000,11,1900,24,15,2000,24.7,16,2200,25.7,21.3,2260,26.7,22,2260,27,26]
[null,4000,7,1900,23.3,16,2100,23.3,16.8,2260,24.3,21.5,2260,25.2,22,"N/B","N/B","N/B"]
[null,6000,3,2000,22,17,2200,22.7,19.3,2260,23.3,22.3,"N/B","N/B","N/B","N/B","N/B","N/B"]
[null,8000,-1,2100,21,18,2200,21.5,21.5,2260,21.5,23,"N/B","N/B","N/B","N/B","N/B","N/B"]
[null,10000,-5,2200,19.7,19,2260,20.100000000000001,22,"N/B","N/B","N/B","N/B","N/B","N/B","N/B","N/B","N/B"]
[null,12000,-9,2260,18.5,19,"N/B","N/B","N/B","N/B","N/B","N/B","N/B","N/B","N/B","N/B","N/B","N/B"]
[null,null,null,null,null,null,null,null,null,null,null,"For each 10°C above ISA temp: increase MAP by 3%, increase F/F by 5%"]
[null,null,null,null,null,null,null,null,null,null,null,"For each 10°C below ISA temp: decrease MAP by 3%, decrease F/F by 5%"]
[]
[null,"Take-off distance"]
[null,"OAT",null,null,null,null,null,null,"mass",null,null,null,null,null,null,"tailwind","headwind",null,null,null,null,null,"ground roll/TOD req"]
[null,null,-30,40,null,null,null,null,750,550,null,null,null,null,null,1,2,3,4,5,null,null,0,50]
[null,0,192,296,null,null,null,1,200,122,1,null,null,null,null,-10,0,10,15,20,null,1,120,222,1]
[null,2000,218,337,null,null,null,2,222,139,2,null,null,null,1,163,120,92,80,76,1,2,152,280,2]
{"$rows_left_out":198}